Error Lnk2019 Template Function

RECOMMENDED: If you have Windows errors then we strongly recommend that you download and run this (Windows) Repair Tool.

Sqlexception Db2 Sql Error Sqlcode=-805 Sqlstate=51002 Sqlerrmc=nullid What does sqlcode -302 means? Where do i get the sqlcode definitions? Please advice Thanks, Jul 16, 2014. com.ibm.db2.jcc.am.SqlException: DB2 SQL Error: SQLCODE=-805, SQLSTATE =51002, SQLERRMC=MDMPROD.NULLID. Error Http 403.14 – Forbidden Iis Description of Microsoft Internet Information Services. – Jul 11, 2017  · 500.12 – Application restarting. This indicates that you tried to load an ASP

But when the template function: template< class T >. LoggerTester.obj : error LNK2019: unresolved external symbol "public: int __thiscall.

I tried to google this but always come back with different issues. I am getting 3 unresolved externals when I try to compile this program: 1>main.obj : error LNK2019.

The latest version of this topic can be found at Linker Tools Error LNK2019. Code that invokes template functions must have matching template function declarations.

Jun 19, 2008  · template and LNK2019. referenced in function _main P_Function.obj Error 6 error LNK2019:. with inline keyword before each function. The reason is that template.

error LNK2019: unresolved external symbol template. Error 1 error LNK2019:. You have to move the implementation of the functions which uses template out.

LNK2019b.cpp // Compile by using: cl /EHsc LNK2019b.cpp // LNK2019 expected struct C { static int s; }; // Uncomment the following line to fix the error. // int C::s; int main() { C c; C::s = 1; } Code that invokes template functions must.

I am learning how to use template in c++ language. but compiler still gives me error is there any thing i need to change in this code please guide me. Thanks in advance. You have to move the implementation of the functions which uses.

Build Errors LNK2019 when using VS2013 and T3D Empty Template. – Quote: Fehler 132 error LNK2019: unresolved external symbol ""public:. instead of 2013's vs120 and using another template project from the project. This is a Link error, meaning a function is defined in the *.h file but not.

Jan 10, 2015  · How do I fix the "error LNK2019: unresolved external symbol". unresolved external symbol NvAPI_GPU_GetThermalSettings referenced in function. Error 29 error.

Mar 13, 2015. libprotobuf.lib(generated_message_reflection.obj) : error LNK2019:. to declaration of specification of class template member functions.

I've been through 20 subject about this error, but I didn't figure how to fix it -I'm using Qt. TEMPLATE = app. //there is 6 functions for now.

Jun 16, 2008. Template classes are instanced in the same way template functions are. Although the syntax is ugly, and the error messages can be cryptic, template classes are truly. Error: LNK2019 unresolved external symbol “class.

The definition of the function DataAs resides in. the implementation of a template class must be completely visible to a compiler from any. error LNK2019.

Aug 31, 2011  · error LNK2019: unresolved external symbol "public:. (definition) of a template class or function must be in the same file as its declaration.

Templates should be implemented in a header or you can use explicit instantiation of a template function/class. LNK2019 error c++ unresolved. error LNK2019.

Linker Tools Error LNK2019. Code that invokes template functions must also have matching template function declarations that include the same template parameters.

referenced in function GA4cQuoRevPostAct_Save NMAKE : fatal error U1077: ‘E:AppsVisualStudio2012VCBINx86_amd64link.EX E’ : return code ‘0x460’ Stop. GA4cQuoRevPostAct_Save.obj :.

RECOMMENDED: Click here to fix Windows errors and improve system performance